{"text_format":"1","workbook":"xlsx","n_sheets":9,"sheets":["Program","Feed Library","Feed Cost Analyzer","Brood Cows","Bulls","Heifers","Feeder Stocker","Analyzer","Batch Mix"],"not_rendered":{"charts":0,"images":2,"macros":1,"external_links":0,"defined_names":6,"comments":4,"pivot_tables":0},"unopened":[],"bounds":{"document_bytes":16777216,"sheet_cells":100000,"rows_first":2000,"rows_last":500,"rows_between":2000,"halvings":0,"cell_chars":16384,"cell_head_chars":4096},"cells_cut":0,"cells_raw":0,"read":"whole","date_system":"1900"}

{"sheet":"Program","index":0,"n_rows":19,"n_cols":15,"rows_kept":19,"cut":false,"hidden":false,"merged":[[18,13,20,15]]}
[]
[]
[]
[]
[]
[]
[]
[null,null,"UGA Basic Balancer Program"]
[]
[null,null,null,null,null,null,null,null,null,null,null,null,null,"UGA Beef Team"]
{"$rows_left_out":10}
{"sheet":"Feed Library","index":1,"n_rows":80,"n_cols":11,"rows_kept":80,"cut":false,"hidden":false,"merged":[]}
[null,"Feed Library"]
[]
[null,null,"Feeds","DM","CP","TDN","Ca","P","$/ton*",null,"Legend"]
[null,null,"FORAGE/ROUGHAGE",null,null,null,null,null,null,null,"DM = Dry Matter"]
[null,1,"Bermudagrass Hay, Good",85,12,60.1,0.38,0.22,100,null,"CP = Crude Protein"]
[null,2,"Bermudagrass Hay, Average",85,9,55,0.36,0.18,90,null,"TDN = Total Digestible Nutrients"]
[null,3,"Bermudagrass Hay, Poor",85,6,48,0.34,0.18,80,null,"Ca = Calcium"]
[null,4,"Tall Fescue Hay, Good",85,16,60,0.43,0.32,120,null,"P = Phosphorus"]
[null,5,"Tall Fescue Hay, Average",85,13,55,0.42,0.31,100,null,"$/ton = dollars per ton of feed stuff"]
[null,6,"Tall Fescue Hay, Poor",85,10,50,0.41,0.3,80,null,"* prices for Pastures are based on "]
{"$rows_left_out":71}
{"sheet":"Feed Cost Analyzer","index":2,"n_rows":36,"n_cols":20,"rows_kept":36,"cut":false,"hidden":false,"merged":[]}
[]
[null,"UGA Feed Cost Analyzer"]
[]
[null,"Date",{"$f":"TODAY()","v":"2020-09-29"},null,"Dr. Lawton Stewart, Animal and Dairy Science"]
[null,"Farm","UGA Farms",null,"Dr. Curt Lacy, Agriculture and Applied Economics"]
[null,null,null,null,"Dr. Dennis Hancock, Crop and Soil Sciences"]
[null,null,null,null,"Local Extension Office: 1-800-ASK-UGA1",null,null,null,null,null,"Instructions:"]
[]
[null,"Ingredients","$/ton","% DM","% CP","% TDN","$/CWT DM","$/lb CP","$/lb TDN",null,"Analyzer"]
[null,"Cottonseed Meal",{"$f":"VLOOKUP(B10,'Feed Library'!$C$5:$I$80,7,FALSE)","v":243},{"$f":"VLOOKUP(B10,'Feed Library'!$C$5:$I$80,2,FALSE)","v":90},{"$f":"VLOOKUP(B10,'Feed Library'!$C$5:$I$80,3,FALSE)","v":46},{"$f":"VLOOKUP(B10,'Feed Library'!$C$5:$I$80,4,FALSE)","v":78},{"$f":"C10/20/(D10/100)","v":13.5},{"$f":"C10/(2000*(D10/100)*(E10/100))","v":0.29347826086956524},{"$f":"C10/(2000*(D10/100)*(F10/100))","v":0.17307692307692307},null,"1)","Adjust nutrient content if a nutrient analysis is available for a given feed."]
{"$rows_left_out":27}
{"sheet":"Brood Cows","index":3,"n_rows":142,"n_cols":52,"rows_kept":142,"cut":false,"hidden":false,"merged":[[136,9,136,18],[131,9,131,18],[132,9,132,18],[133,9,133,18],[134,9,134,18],[135,9,135,18]]}
[null,null,"UGA Basic Balancer - Brood Cows"]
[null,null,"Description",null,null,null,null,null,"REQUIREMENTS:",null,"Notes:"]
[null,null,"Farm","UGA Farms",null,null,null,null,"TDN, %",{"$f":"VLOOKUP(D6,U12:Z45,4,FALSE)","v":60},"•"]
[null,null,"Group Size",250,null,null,null,null,"CP, %",{"$f":"VLOOKUP(D6,U12:Z45,3,FALSE)","v":10.5},"•"]
[null,null,"Avg Weight",1200,null,null,null,null,"Ca, %",{"$f":"VLOOKUP(D6,U10:Z45,5,FALSE)","v":0.28000000000000003},"•"]
[null,null,"Target Gain","Peak Lactation       BW-1200",null,null,null,null,"P, %",{"$f":"VLOOKUP(D6,U12:Z45,6,FALSE)","v":0.19},"•"]
[null,null,null,null,null,null,null,null,"DM Intake, lb/d",{"$f":"VLOOKUP(D6,U12:Z45,2,FALSE)*D5","v":24},"•"]
[null,null,null,null,null,null,null,null,null,null,"•"]
[null,"Diet Formulation",null,null,null,"Ingredient","TDN, %","CP, %",null,null,null,null,null,null,null,null,null,null,null,null,null,"Requirements"]
[null,1,"Constant ingredient (% DM)",0,null,"BLANK",{"$f":"VLOOKUP(F10,'Feed Library'!C5:F80,4,FALSE)","v":0.1},{"$f":"VLOOKUP(F10,'Feed Library'!C5:F80,3,FALSE)","v":0.1},null,null,null,null,null,null,null,null,null,null,null,null,"Stage of Production  -  Mature Body Weight","DM Intake","CP","TDN","Ca","P"]
{"$rows_left_out":133}
{"sheet":"Bulls","index":4,"n_rows":142,"n_cols":52,"rows_kept":142,"cut":false,"hidden":false,"merged":[[136,9,136,18],[131,9,131,18],[132,9,132,18],[133,9,133,18],[134,9,134,18],[135,9,135,18]]}
[null,null,"UGA Basic Balancer - Bulls"]
[null,null,"Description",null,null,null,null,null,"REQUIREMENTS:",null,"Notes:"]
[null,null,"Farm","UGA Farms",null,null,null,null,"TDN, %",{"$f":"VLOOKUP(D6,U12:Z45,4,FALSE)","v":76.5},"•"]
[null,null,"Group Size",10,null,null,null,null,"CP, %",{"$f":"VLOOKUP(D6,U12:Z45,3,FALSE)","v":10.8},"•"]
[null,null,"Avg Weight",800,null,null,null,null,"Ca, %",{"$f":"VLOOKUP(D6,U10:Z45,5,FALSE)","v":0.44},"•"]
[null,null,"Target Gain","BW-800     ADG-3.0",null,null,null,null,"P, %",{"$f":"VLOOKUP(D6,U12:Z45,6,FALSE)","v":0.24},"•"]
[null,null,null,null,null,null,null,null,"DM Intake, lb/d",{"$f":"VLOOKUP(D6,U12:Z45,2,FALSE)*D5","v":18.2},"•"]
[null,null,null,null,null,null,null,null,null,null,"•"]
[null,"Diet Formulation",null,null,null,"Ingredient","TDN, %","CP, %",null,null,null,null,null,null,null,null,null,null,null,null,null,"Requirements"]
[null,1,"Constant ingredient (% DM)",0,null,"Corn",{"$f":"VLOOKUP(F10,'Feed Library'!C5:F80,4,FALSE)","v":90},{"$f":"VLOOKUP(F10,'Feed Library'!C5:F80,3,FALSE)","v":9},null,null,null,null,null,null,null,null,null,null,null,null,"ADG","DM Intake","CP","TDN","Ca","P"]
{"$rows_left_out":133}
{"sheet":"Heifers","index":5,"n_rows":142,"n_cols":52,"rows_kept":142,"cut":false,"hidden":false,"merged":[[136,9,136,18],[131,9,131,18],[132,9,132,18],[133,9,133,18],[134,9,134,18],[135,9,135,18]]}
[null,null,"UGA Basic Balancer - Heifers"]
[null,null,"Description",null,null,null,null,null,"REQUIREMENTS:",null,"Notes:"]
[null,null,"Farm","UGA Farms",null,null,null,null,"TDN, %",{"$f":"VLOOKUP(D6,U12:Z65,4,FALSE)","v":65.5},"•"]
[null,null,"Group Size",50,null,null,null,null,"CP, %",{"$f":"VLOOKUP(D6,U12:Z65,3,FALSE)","v":10.7},"•"]
[null,null,"Avg Weight",700,null,null,null,null,"Ca, %",{"$f":"VLOOKUP(D6,U10:Z65,5,FALSE)","v":0.375},"•"]
[null,null,"Target Gain","BW-700      ADG-1.75",null,null,null,null,"P, %",{"$f":"VLOOKUP(D6,U12:Z65,6,FALSE)","v":0.2},"•"]
[null,null,null,null,null,null,null,null,"DM Intake, lb/d",{"$f":"VLOOKUP(D6,U12:Z65,2,FALSE)*D5","v":16.239999999999998},"•"]
[null,null,null,null,null,null,null,null,null,null,"•"]
[null,"Diet Formulation",null,null,null,"Ingredient","TDN, %","CP, %",null,null,null,null,null,null,null,null,null,null,null,null,null,"Requirements"]
[null,1,"Constant ingredient (% DM)",0,null,"BLANK",{"$f":"VLOOKUP(F10,'Feed Library'!C5:F80,4,FALSE)","v":0.1},{"$f":"VLOOKUP(F10,'Feed Library'!C5:F80,3,FALSE)","v":0.1},null,null,null,null,null,null,null,null,null,null,null,null,"ADG","DM Intake","CP","TDN","Ca","P"]
{"$rows_left_out":133}
{"sheet":"Feeder Stocker","index":6,"n_rows":142,"n_cols":52,"rows_kept":142,"cut":false,"hidden":false,"merged":[[136,9,136,18],[131,9,131,18],[132,9,132,18],[133,9,133,18],[134,9,134,18],[135,9,135,18]]}
[null,null,"UGA Basic Balancer - Feeder/Stocker Cattle"]
[null,null,"Description",null,null,null,null,null,"REQUIREMENTS:",null,"Notes:"]
[null,null,"Farm","UGA Farms",null,null,null,null,"TDN, %",{"$f":"VLOOKUP(D6,U12:Z45,4,FALSE)","v":67.5},"•"]
[null,null,"Group Size",500,null,null,null,null,"CP, %",{"$f":"VLOOKUP(D6,U12:Z45,3,FALSE)","v":11.4},"•"]
[null,null,"Avg Weight",500,null,null,null,null,"Ca, %",{"$f":"VLOOKUP(D6,U10:Z45,5,FALSE)","v":0.47},"•"]
[null,null,"Target Gain","BW-500      ADG-2.0",null,null,null,null,"P, %",{"$f":"VLOOKUP(D6,U12:Z45,6,FALSE)","v":0.24},"•"]
[null,null,null,null,null,null,null,null,"DM Intake, lb/d",{"$f":"VLOOKUP(D6,U12:Z45,2,FALSE)*D5","v":13.100000000000001},"•"]
[null,null,null,null,null,null,null,null,null,null,"•"]
[null,"Diet Formulation",null,null,null,"Ingredient","TDN, %","CP, %",null,null,null,null,null,null,null,null,null,null,null,null,null,"Requirements"]
[null,1,"Constant ingredient (% DM)",0,null,"BLANK",{"$f":"VLOOKUP(F10,'Feed Library'!C5:F80,4,FALSE)","v":0.1},{"$f":"VLOOKUP(F10,'Feed Library'!C5:F80,3,FALSE)","v":0.1},null,null,null,null,null,null,null,null,null,null,null,null,"ADG","DM Intake","CP","TDN","Ca","P"]
{"$rows_left_out":133}
{"sheet":"Analyzer","index":7,"n_rows":16,"n_cols":18,"rows_kept":16,"cut":false,"hidden":false,"merged":[[3,13,3,14],[3,2,3,3],[3,4,3,5],[3,11,3,12]]}
[null,"Ration Analyzer"]
[]
[null,"Ration 1",null,null,null,null,null,null,null,null,"Ration 2"]
[null,null,"As Fed",null,"Dry Matter",null,null,"Diet Analysis",null,null,null,"As Fed",null,"Dry Matter",null,null,"Diet Analysis"]
[null,"Ingredients","lb/ton, lb/hd, or %"," %","lb","% of ration",null,"Item","%",null,"Ingredients","lb/ton, lb/hd, or %"," %","lb","% of ration",null,"Item","%"]
[null,"Dried Distiller's Grains",0,{"$f":"$C6/SUM($C$6:$C$15)","v":0},{"$f":"C6*(VLOOKUP(B6,'Feed Library'!$C$5:$I$80,2,FALSE)/100)","v":0},{"$f":"$E6/SUM($E$6:$E$15)","v":0},null,"DM",{"$f":"(VLOOKUP(B6,'Feed Library'!C5:I80,2,FALSE)*F6)+(VLOOKUP(B7,'Feed Library'!C5:I80,2,FALSE)*F7)+(VLOOKUP(B8,'Feed Library'!C5:I80,2,FALSE)*F8)+(VLOOKUP(B9,'Feed Library'!C5:I80,2,FALSE)*F9)+(VLOOKUP(B10,'Feed Library'!C5:I80,2,FALSE)*F10)+(VLOOKUP(B11,'Feed Library'!C5:I80,2,FALSE)*F11)+(VLOOKUP(B12,'Feed Library'!C5:I80,2,FALSE)*F12)+(VLOOKUP(B13,'Feed Library'!C5:I80,2,FALSE)*F13)+(VLOOKUP(B14,'Feed Library'!C5:I80,2,FALSE)*F14)+(VLOOKUP(B15,'Feed Library'!C5:I80,2,FALSE)*F15)","v":90},null,"Bermudagrass Hay, Average",1000,{"$f":"$L6/SUM($L$6:$L$15)","v":0.49627791563275436},{"$f":"L6*(VLOOKUP(K6,'Feed Library'!$C$5:$I$80,2,FALSE)/100)","v":850},{"$f":"$N6/SUM($N$6:$N$15)","v":0.4816273337677423},null,"DM",{"$f":"(VLOOKUP(K6,'Feed Library'!C5:I80,2,FALSE)*O6)+(VLOOKUP(K7,'Feed Library'!C5:I80,2,FALSE)*O7)+(VLOOKUP(K8,'Feed Library'!C5:I80,2,FALSE)*O8)+(VLOOKUP(K9,'Feed Library'!C5:I80,2,FALSE)*O9)+(VLOOKUP(K10,'Feed Library'!C5:I80,2,FALSE)*O10)+(VLOOKUP(K11,'Feed Library'!C5:I80,2,FALSE)*O11)+(VLOOKUP(K12,'Feed Library'!C5:I80,2,FALSE)*O12)+(VLOOKUP(K13,'Feed Library'!C5:I80,2,FALSE)*O13)+(VLOOKUP(K14,'Feed Library'!C5:I80,2,FALSE)*O14)+(VLOOKUP(K15,'Feed Library'!C5:I80,2,FALSE)*O15)","v":87.667592146641354}]
[null,"Salt",0,0,{"$f":"C7*(VLOOKUP(B7,'Feed Library'!$C$5:$I$80,2,FALSE)/100)","v":0},0,null,"CP",{"$f":"(VLOOKUP(B6,'Feed Library'!C5:I80,3,FALSE)*F6)+(VLOOKUP(B7,'Feed Library'!C5:I80,3,FALSE)*F7)+(VLOOKUP(B8,'Feed Library'!C5:I80,3,FALSE)*F8)+(VLOOKUP(B9,'Feed Library'!C5:I80,3,FALSE)*F9)+(VLOOKUP(B10,'Feed Library'!C5:I80,3,FALSE)*F10)+(VLOOKUP(B11,'Feed Library'!C5:I80,3,FALSE)*F11)+(VLOOKUP(B12,'Feed Library'!C5:I80,3,FALSE)*F12)+(VLOOKUP(B13,'Feed Library'!C5:I80,3,FALSE)*F13)+(VLOOKUP(B14,'Feed Library'!C5:I80,3,FALSE)*F14)+(VLOOKUP(B15,'Feed Library'!C5:I80,3,FALSE)*F15)","v":12.5},null,"Gin Trash",0,{"$f":"$L7/SUM($L$6:$L$15)","v":0},{"$f":"L7*(VLOOKUP(K7,'Feed Library'!$C$5:$I$80,2,FALSE)/100)","v":0},{"$f":"$N7/SUM($N$6:$N$15)","v":0},null,"CP",{"$f":"(VLOOKUP(K6,'Feed Library'!C5:I80,3,FALSE)*O6)+(VLOOKUP(K7,'Feed Library'!C5:I80,3,FALSE)*O7)+(VLOOKUP(K8,'Feed Library'!C5:I80,3,FALSE)*O8)+(VLOOKUP(K9,'Feed Library'!C5:I80,3,FALSE)*O9)+(VLOOKUP(K10,'Feed Library'!C5:I80,3,FALSE)*O10)+(VLOOKUP(K11,'Feed Library'!C5:I80,3,FALSE)*O11)+(VLOOKUP(K12,'Feed Library'!C5:I80,3,FALSE)*O12)+(VLOOKUP(K13,'Feed Library'!C5:I80,3,FALSE)*O13)+(VLOOKUP(K14,'Feed Library'!C5:I80,3,FALSE)*O14)+(VLOOKUP(K15,'Feed Library'!C5:I80,3,FALSE)*O15)","v":8.7211292744425872}]
[null,"Limestone",0,0,{"$f":"C8*(VLOOKUP(B8,'Feed Library'!$C$5:$I$80,2,FALSE)/100)","v":0},0,null,"TDN",{"$f":"(VLOOKUP(B6,'Feed Library'!C5:I80,4,FALSE)*F6)+(VLOOKUP(B7,'Feed Library'!C5:I80,4,FALSE)*F7)+(VLOOKUP(B8,'Feed Library'!C5:I80,4,FALSE)*F8)+(VLOOKUP(B9,'Feed Library'!C5:I80,4,FALSE)*F9)+(VLOOKUP(B10,'Feed Library'!C5:I80,4,FALSE)*F10)+(VLOOKUP(B11,'Feed Library'!C5:I80,4,FALSE)*F11)+(VLOOKUP(B12,'Feed Library'!C5:I80,4,FALSE)*F12)+(VLOOKUP(B13,'Feed Library'!C5:I80,4,FALSE)*F13)+(VLOOKUP(B14,'Feed Library'!C5:I80,4,FALSE)*F14)+(VLOOKUP(B15,'Feed Library'!C5:I80,4,FALSE)*F15)","v":69},null,"Corn",800,0.3970223325062035,{"$f":"L8*(VLOOKUP(K8,'Feed Library'!$C$5:$I$80,2,FALSE)/100)","v":720},0.40796668272091113,null,"TDN",{"$f":"(VLOOKUP(K6,'Feed Library'!C5:I80,4,FALSE)*O6)+(VLOOKUP(K7,'Feed Library'!C5:I80,4,FALSE)*O7)+(VLOOKUP(K8,'Feed Library'!C5:I80,4,FALSE)*O8)+(VLOOKUP(K9,'Feed Library'!C5:I80,4,FALSE)*O9)+(VLOOKUP(K10,'Feed Library'!C5:I80,4,FALSE)*O10)+(VLOOKUP(K11,'Feed Library'!C5:I80,4,FALSE)*O11)+(VLOOKUP(K12,'Feed Library'!C5:I80,4,FALSE)*O12)+(VLOOKUP(K13,'Feed Library'!C5:I80,4,FALSE)*O13)+(VLOOKUP(K14,'Feed Library'!C5:I80,4,FALSE)*O14)+(VLOOKUP(K15,'Feed Library'!C5:I80,4,FALSE)*O15)","v":71.570663229169611}]
[null,"Peanut Hulls",25,0.25,{"$f":"C9*(VLOOKUP(B9,'Feed Library'!$C$5:$I$80,2,FALSE)/100)","v":22.5},0.25,null,"Ca",{"$f":"(VLOOKUP(B6,'Feed Library'!C5:I80,5,FALSE)*F6)+(VLOOKUP(B7,'Feed Library'!C5:I80,5,FALSE)*F7)+(VLOOKUP(B8,'Feed Library'!C5:I80,5,FALSE)*F8)+(VLOOKUP(B9,'Feed Library'!C5:I80,5,FALSE)*F9)+(VLOOKUP(B10,'Feed Library'!C5:I80,5,FALSE)*F10)+(VLOOKUP(B11,'Feed Library'!C5:I80,5,FALSE)*F11)+(VLOOKUP(B12,'Feed Library'!C5:I80,5,FALSE)*F12)+(VLOOKUP(B13,'Feed Library'!C5:I80,5,FALSE)*F13)+(VLOOKUP(B14,'Feed Library'!C5:I80,5,FALSE)*F14)+(VLOOKUP(B15,'Feed Library'!C5:I80,5,FALSE)*F15)","v":0.46250000000000002},null,"Citrus Pulp",200,9.9255583126550875E-2,{"$f":"L9*(VLOOKUP(K9,'Feed Library'!$C$5:$I$80,2,FALSE)/100)","v":180},0.10199167068022778,null,"Ca",{"$f":"(VLOOKUP(K6,'Feed Library'!C5:I80,5,FALSE)*O6)+(VLOOKUP(K7,'Feed Library'!C5:I80,5,FALSE)*O7)+(VLOOKUP(K8,'Feed Library'!C5:I80,5,FALSE)*O8)+(VLOOKUP(K9,'Feed Library'!C5:I80,5,FALSE)*O9)+(VLOOKUP(K10,'Feed Library'!C5:I80,5,FALSE)*O10)+(VLOOKUP(K11,'Feed Library'!C5:I80,5,FALSE)*O11)+(VLOOKUP(K12,'Feed Library'!C5:I80,5,FALSE)*O12)+(VLOOKUP(K13,'Feed Library'!C5:I80,5,FALSE)*O13)+(VLOOKUP(K14,'Feed Library'!C5:I80,5,FALSE)*O14)+(VLOOKUP(K15,'Feed Library'!C5:I80,5,FALSE)*O15)","v":0.6932883814488483}]
[null,"Corn Gluten Feed",25,0.25,{"$f":"C10*(VLOOKUP(B10,'Feed Library'!$C$5:$I$80,2,FALSE)/100)","v":22.5},0.25,null,"P",{"$f":"(VLOOKUP(B6,'Feed Library'!C5:I80,6,FALSE)*F6)+(VLOOKUP(B7,'Feed Library'!C5:I80,6,FALSE)*F7)+(VLOOKUP(B8,'Feed Library'!C5:I80,6,FALSE)*F8)+(VLOOKUP(B9,'Feed Library'!C5:I80,6,FALSE)*F9)+(VLOOKUP(B10,'Feed Library'!C5:I80,6,FALSE)*F10)+(VLOOKUP(B11,'Feed Library'!C5:I80,6,FALSE)*F11)+(VLOOKUP(B12,'Feed Library'!C5:I80,6,FALSE)*F12)+(VLOOKUP(B13,'Feed Library'!C5:I80,6,FALSE)*F13)+(VLOOKUP(B14,'Feed Library'!C5:I80,6,FALSE)*F14)+(VLOOKUP(B15,'Feed Library'!C5:I80,6,FALSE)*F15)","v":0.29749999999999999},null,"Limestone",15,7.4441687344913151E-3,{"$f":"L10*(VLOOKUP(K10,'Feed Library'!$C$5:$I$80,2,FALSE)/100)","v":14.85},8.414312831118792E-3,null,"P",{"$f":"(VLOOKUP(K6,'Feed Library'!C5:I80,6,FALSE)*O6)+(VLOOKUP(K7,'Feed Library'!C5:I80,6,FALSE)*O7)+(VLOOKUP(K8,'Feed Library'!C5:I80,6,FALSE)*O8)+(VLOOKUP(K9,'Feed Library'!C5:I80,6,FALSE)*O9)+(VLOOKUP(K10,'Feed Library'!C5:I80,6,FALSE)*O10)+(VLOOKUP(K11,'Feed Library'!C5:I80,6,FALSE)*O11)+(VLOOKUP(K12,'Feed Library'!C5:I80,6,FALSE)*O12)+(VLOOKUP(K13,'Feed Library'!C5:I80,6,FALSE)*O13)+(VLOOKUP(K14,'Feed Library'!C5:I80,6,FALSE)*O14)+(VLOOKUP(K15,'Feed Library'!C5:I80,6,FALSE)*O15)","v":0.24486415276085782}]
{"$rows_left_out":7}
{"sheet":"Batch Mix","index":8,"n_rows":16,"n_cols":10,"rows_kept":16,"cut":false,"hidden":false,"merged":[[3,5,3,6],[3,2,3,4]]}
[null,"Batch Mix"]
[]
[null,"Batch size, lb",2000]
[null,null,"As Fed",null,null,"Dry Matter",null,null,"Diet Analysis"]
[null,"Ingredients","lb/ton, lb/hd, or %"," %","lb/batch","lb","% of ration",null,"Item","%"]
[null,"Dried Distiller's Grains",3,{"$f":"$C6/SUM($C$6:$C$15)","v":0.88235294117647056},{"$f":"$C$3*D6","v":1764.7058823529412},{"$f":"C6*(VLOOKUP(B6,'Feed Library'!$C$5:$I$80,2,FALSE)/100)","v":2.7},{"$f":"$F6/SUM($F$6:$F$15)","v":0.87209302325581395},null,"DM",{"$f":"(VLOOKUP(B6,'Feed Library'!C5:I80,2,FALSE)*G6)+(VLOOKUP(B7,'Feed Library'!C5:I80,2,FALSE)*G7)+(VLOOKUP(B8,'Feed Library'!C5:I80,2,FALSE)*G8)+(VLOOKUP(B9,'Feed Library'!C5:I80,2,FALSE)*G9)+(VLOOKUP(B10,'Feed Library'!C5:I80,2,FALSE)*G10)+(VLOOKUP(B11,'Feed Library'!C5:I80,2,FALSE)*G11)+(VLOOKUP(B12,'Feed Library'!C5:I80,2,FALSE)*G12)+(VLOOKUP(B13,'Feed Library'!C5:I80,2,FALSE)*G13)+(VLOOKUP(B14,'Feed Library'!C5:I80,2,FALSE)*G14)+(VLOOKUP(B15,'Feed Library'!C5:I80,2,FALSE)*G15)","v":91.151162790697683}]
[null,"Soybean Hulls",0,0,{"$f":"$C$3*D7","v":0},{"$f":"C7*(VLOOKUP(B7,'Feed Library'!$C$5:$I$80,2,FALSE)/100)","v":0},0,null,"CP",{"$f":"(VLOOKUP(B6,'Feed Library'!C5:I80,3,FALSE)*G6)+(VLOOKUP(B7,'Feed Library'!C5:I80,3,FALSE)*G7)+(VLOOKUP(B8,'Feed Library'!C5:I80,3,FALSE)*G8)+(VLOOKUP(B9,'Feed Library'!C5:I80,3,FALSE)*G9)+(VLOOKUP(B10,'Feed Library'!C5:I80,3,FALSE)*G10)+(VLOOKUP(B11,'Feed Library'!C5:I80,3,FALSE)*G11)+(VLOOKUP(B12,'Feed Library'!C5:I80,3,FALSE)*G12)+(VLOOKUP(B13,'Feed Library'!C5:I80,3,FALSE)*G13)+(VLOOKUP(B14,'Feed Library'!C5:I80,3,FALSE)*G14)+(VLOOKUP(B15,'Feed Library'!C5:I80,3,FALSE)*G15)","v":24.431395348837214}]
[null,"Limestone",0.15,4.4117647058823532E-2,88.235294117647058,{"$f":"C8*(VLOOKUP(B8,'Feed Library'!$C$5:$I$80,2,FALSE)/100)","v":0.14849999999999999},4.7965116279069762E-2,null,"TDN",{"$f":"(VLOOKUP(B6,'Feed Library'!C5:I80,4,FALSE)*G6)+(VLOOKUP(B7,'Feed Library'!C5:I80,4,FALSE)*G7)+(VLOOKUP(B8,'Feed Library'!C5:I80,4,FALSE)*G8)+(VLOOKUP(B9,'Feed Library'!C5:I80,4,FALSE)*G9)+(VLOOKUP(B10,'Feed Library'!C5:I80,4,FALSE)*G10)+(VLOOKUP(B11,'Feed Library'!C5:I80,4,FALSE)*G11)+(VLOOKUP(B12,'Feed Library'!C5:I80,4,FALSE)*G12)+(VLOOKUP(B13,'Feed Library'!C5:I80,4,FALSE)*G13)+(VLOOKUP(B14,'Feed Library'!C5:I80,4,FALSE)*G14)+(VLOOKUP(B15,'Feed Library'!C5:I80,4,FALSE)*G15)","v":80.245348837209306}]
[null,"Basic",0.25,7.3529411764705885E-2,147.05882352941177,{"$f":"C9*(VLOOKUP(B9,'Feed Library'!$C$5:$I$80,2,FALSE)/100)","v":0.2475},7.9941860465116282E-2,null,"Ca",{"$f":"(VLOOKUP(B6,'Feed Library'!C5:I80,5,FALSE)*G6)+(VLOOKUP(B7,'Feed Library'!C5:I80,5,FALSE)*G7)+(VLOOKUP(B8,'Feed Library'!C5:I80,5,FALSE)*G8)+(VLOOKUP(B9,'Feed Library'!C5:I80,5,FALSE)*G9)+(VLOOKUP(B10,'Feed Library'!C5:I80,5,FALSE)*G10)+(VLOOKUP(B11,'Feed Library'!C5:I80,5,FALSE)*G11)+(VLOOKUP(B12,'Feed Library'!C5:I80,5,FALSE)*G12)+(VLOOKUP(B13,'Feed Library'!C5:I80,5,FALSE)*G13)+(VLOOKUP(B14,'Feed Library'!C5:I80,5,FALSE)*G14)+(VLOOKUP(B15,'Feed Library'!C5:I80,5,FALSE)*G15)","v":2.8735465116279069}]
[null,"Corn Gluten Feed",0,0,0,{"$f":"C10*(VLOOKUP(B10,'Feed Library'!$C$5:$I$80,2,FALSE)/100)","v":0},0,null,"P",{"$f":"(VLOOKUP(B6,'Feed Library'!C5:I80,6,FALSE)*G6)+(VLOOKUP(B7,'Feed Library'!C5:I80,6,FALSE)*G7)+(VLOOKUP(B8,'Feed Library'!C5:I80,6,FALSE)*G8)+(VLOOKUP(B9,'Feed Library'!C5:I80,6,FALSE)*G9)+(VLOOKUP(B10,'Feed Library'!C5:I80,6,FALSE)*G10)+(VLOOKUP(B11,'Feed Library'!C5:I80,6,FALSE)*G11)+(VLOOKUP(B12,'Feed Library'!C5:I80,6,FALSE)*G12)+(VLOOKUP(B13,'Feed Library'!C5:I80,6,FALSE)*G13)+(VLOOKUP(B14,'Feed Library'!C5:I80,6,FALSE)*G14)+(VLOOKUP(B15,'Feed Library'!C5:I80,6,FALSE)*G15)","v":1.4074563953488373}]
{"$rows_left_out":6}